{"text_format":"1","workbook":"xlsx","n_sheets":12,"sheets":["LD_Antrag_2023","Auswahl","Wander - u. Bergwege","MTB-Routen u. Singletrails","Klettergärten","Klettersteige","Bouldergebiete","Pisten-u. Skitouren, Freeride","Winterwandewege","LD- Infrastruktur","Leistsysteme-Beschilderung","Interressenausgleich Naturraum"],"not_rendered":{"charts":0,"images":5,"macros":1,"external_links":0,"defined_names":1,"comments":0,"pivot_tables":0},"unopened":[],"bounds":{"document_bytes":16777216,"sheet_cells":100000,"rows_first":2000,"rows_last":500,"rows_between":2000,"halvings":0,"cell_chars":16384,"cell_head_chars":4096},"cells_cut":0,"cells_raw":0,"read":"whole","date_system":"1900"}

{"sheet":"LD_Antrag_2023","index":0,"n_rows":120,"n_cols":28,"rows_kept":120,"cut":false,"hidden":false,"merged":[[119,2,119,7],[119,11,119,19],[1,0,2,19],[4,0,4,19],[113,1,113,19],[114,1,114,19],[115,1,115,19],[117,0,117,19],[108,1,108,19],[109,1,109,19],[110,1,110,19],[111,1,111,19],[112,1,112,19],[102,1,102,19],[103,1,103,19],[104,1,104,19],[105,1,105,19],[106,1,106,19],[107,1,107,19],[99,1,99,19],[100,1,100,19],[101,1,101,19],[80,13,80,17],[91,15,92,20],[76,0,76,1],[72,0,72,1],[74,0,74,1],[78,15,78,18],[95,0,95,19],[98,1,98,19],[91,10,92,12],[74,15,74,18],[83,0,89,19],[77,13,77,14],[78,13,78,14],[73,2,73,9],[74,2,74,9],[75,2,75,9],[76,2,76,9],[76,13,76,14],[72,13,72,14],[74,13,74,14],[75,0,75,1],[58,0,58,1],[58,13,58,14],[62,0,62,1],[65,0,65,1],[64,2,64,9],[65,2,65,9],[67,0,67,1],[67,13,67,14],[72,2,72,9],[70,0,70,1],[62,10,63,10],[62,11,63,11],[61,2,61,9],[64,13,64,14],[66,0,66,1],[66,2,66,9],[26,0,27,7],[30,0,31,7],[56,2,56,9],[57,2,57,9],[55,13,55,14],[73,21,73,23],[56,21,56,23],[58,21,58,23],[72,15,72,17],[63,13,63,14],[59,13,59,14],[71,11,72,11],[54,2,54,9],[54,0,54,1],[55,0,55,1],[63,0,63,1],[55,2,55,9],[63,2,63,9],[56,0,56,1],[56,13,56,14],[64,0,64,1],[57,0,57,1],[57,13,57,14],[53,10,54,10],[5,7,6,16],[8,0,9,8],[9,11,11,11],[21,9,21,12],[22,9,22,12],[13,7,13,8],[15,7,15,8],[19,4,19,7],[8,14,15,19],[17,14,23,17],[17,18,20,19],[21,0,21,4],[21,5,21,7],[21,18,23,19],[11,7,11,8],[14,10,14,12],[53,11,54,11],[37,14,38,19],[41,17,41,19],[28,18,31,19],[32,18,34,19],[41,0,41,1],[53,0,53,1],[52,0,52,1],[52,2,52,9],[53,14,53,18],[54,13,54,14],[53,12,53,13],[33,0,33,7],[42,1,42,12],[43,0,43,20],[42,14,42,16],[42,17,42,20],[41,2,41,11],[25,14,26,19],[41,14,41,16],[28,14,34,17],[54,15,54,17],[41,12,41,13],[70,13,70,17],[73,15,73,18],[63,15,63,17],[56,15,56,18],[68,13,68,14],[73,13,73,14],[66,13,66,14],[62,12,62,13],[71,12,71,13],[65,13,65,14],[71,14,71,18],[62,14,62,18],[58,15,58,18],[59,15,59,18],[68,15,68,18],[67,15,67,18],[57,15,57,18],[24,9,24,12],[26,9,27,12],[30,9,31,12],[32,9,32,12],[28,9,28,12],[44,0,49,19],[81,13,81,19],[64,15,64,18],[65,15,65,18],[66,15,66,18],[37,0,37,4],[24,0,24,7],[61,0,61,1],[75,15,75,18],[70,2,70,9],[67,2,67,9],[58,2,58,9],[76,15,76,18],[77,15,77,18],[75,13,75,14],[71,10,72,10],[71,0,71,1],[73,0,73,1],[55,15,55,18]]}
[]
["Förderungsantrag"]
[]
[]
["zur Förderung eines Projektes im Rahmen der Richtlinie Zuwendungen zur Erholungsraumgestaltung lt. B. der Tiroler Landesregierung vom 05.04.2016"]
[]
[]
[]
[null,null,null,null,null,null,null,null,null,null,null,null,null,null,"Amt der Tiroler Landesregierung\nGruppe Forst\nBürgerstraße 36\n6020 Innsbruck"]
[]
[]
[null,"Natürliche Person",null,null,null,"Geb. Datum:"]
[]
[null,"Ehegemeinschaft",null,null,null,"Geb. Datum Gattin:"]
[]
[null,null,null,null,null,"Geb. Datum Gatte:",null,null,null,null,null,"ZVR/FB - Nr."]
[]
[null,"juristische Person / Personengemeinschaft",null,null,null,null,null,null,null,null,null,null,null,null,"Eingangsstempel Einreichstelle",null,null,null,"Entgegengenommen"]
[]
[null,"Gesellschaftsform",null,null,"KÖR"]
[]
[null,null,null,null,null,null,null,null,null,null,null,null,null,null,null,null,null,null,"Erfasst"]
["Vertretungsbefugte(r) (bei jur. Person, Gebietskörpersch.), Geburtsdatum",null,null,null,null,null,null,null,null,"Postleitzahl, Postort      "]
[]
[]
["Zuname(n), Vorname(n), Titel, Unternehmensbezeichnung",null,null,null,null,null,null,null,null,"Telefonnummer",null,null,"Faxnummer",null,"Eingangsnummer (durch Einreichsstelle zu vergeben):"]
[]
[null,null,null,null,null,null,null,null,null,null,null,null,null,null,null,null,null,null,4]
["Zustelladresse: Ortschaft, Straße, Hausnummer",null,null,null,null,null,null,null,null,"E-Mailadresse",null,null,null,null,"Eingangsstempel Bewilligungsst.",null,null,null,"Entgegengenommen"]
[]
[]
[]
["IBAN",null,null,null,null,null,null,null,null,"BIC",null,null,null,null,null,null,null,null,"Erfasst"]
[]
["Name d. Unterschriftsberechtigten"]
[]
[]
["Vorsteuerabzugsberechtigt",null,null,null,null,null,null,null,null,null,null,null,null,null,"Antragsnummer (durch Bewilligungsstelle zu vergeben):"]
[]
[]
[]
["Projektname",null,null,null,null,null,null,null,null,null,null,null,"Zeitplan  "]
[null,null,null,null,null,null,null,null,null,null,null,null,null,null,"Beginn",null,null,"Ende"]
["Projektbeschreibung"]
[]
[]
[]
[]
[]
[]
[]
[]
["Kategorie",null,"Auswahl",null,null,null,null,null,null,null,null,null,null,null,null,null,null,null,null,null,null,null,null,null,null,null,2]
["Projektteil 1",null,null,null,null,null,null,null,null,null,"Kosten","Standard kosten","Bezeichnung:"]
["FAI-Code",null,"Maßnahme",null,null,null,null,null,null,null,null,null,"Einheit","Menge",null,"Nettokosten"]
[null,null,"",null,null,null,null,null,null,null,null,null,null,null,null,null,null,null,null,null,null,null,null,null,null,null,1,{"$f":"IFERROR(INDEX(Carrier1,LD_Antrag_2023!AA56,2),\"\")","v":""}]
[null,null,"",null,null,null,null,null,null,null,null,null,null,null,null,null,null,null,null,null,null,null,null,null,null,null,1,{"$f":"IFERROR(INDEX(Carrier1,LD_Antrag_2023!AA57,2),\"\")","v":""}]
[null,null,"",null,null,null,null,null,null,null,null,null,null,null,null,null,null,null,null,null,null,null,null,null,null,null,1,{"$f":"IFERROR(INDEX(Carrier1,LD_Antrag_2023!AA58,2),\"\")","v":""}]
[null,null,"",null,null,null,null,null,null,null,null,null,null,null,null,null,null,null,null,null,null,null,null,null,null,null,1,{"$f":"IFERROR(INDEX(Carrier1,LD_Antrag_2023!AA59,2),\"\")","v":""}]
[null,null,null,null,null,null,null,null,null,null,null,null,null,"Summe:",null,{"$f":"SUM(P56:S59)","v":0}]
[]
["Kategorie",null,"Auswahl",null,null,null,null,null,null,null,null,null,null,null,null,null,null,null,null,null,null,null,null,null,null,null,2]
["Projektteil 2",null,null,null,null,null,null,null,null,null,"Kosten","Standard kosten","Bezeichnung:"]
["FAI-Code",null,"Maßnahme",null,null,null,null,null,null,null,null,null,"Einheit","Menge",null,"Nettokosten"]
[null,null,"",null,null,null,null,null,null,null,null,null,null,null,null,null,null,null,null,null,null,null,null,null,null,null,1,{"$f":"IFERROR(INDEX(Carrier4,LD_Antrag_2023!AA65,2),\"\")","v":""}]
[null,null,"",null,null,null,null,null,null,null,null,null,null,null,null,null,null,null,null,null,null,null,null,null,null,null,1,{"$f":"IFERROR(INDEX(Carrier4,LD_Antrag_2023!AA66,2),\"\")","v":""}]
[null,null,null,null,null,null,null,null,null,null,null,null,null,null,null,null,null,null,null,null,null,null,null,null,null,null,1,{"$f":"IFERROR(INDEX(Carrier4,LD_Antrag_2023!AA67,2),\"\")","v":""}]
[null,null,null,null,null,null,null,null,null,null,null,null,null,null,null,null,null,null,null,null,null,null,null,null,null,null,1,{"$f":"IFERROR(INDEX(Carrier4,LD_Antrag_2023!AA68,2),\"\")","v":""}]
[null,null,null,null,null,null,null,null,null,null,null,null,null,"Summe:",null,{"$f":"SUM(P65:S68)","v":0}]
[]
["Kategorie",null,"Auswahl",null,null,null,null,null,null,null,null,null,null,null,null,null,null,null,null,null,null,null,null,null,null,null,2]
["Projektteil 3",null,null,null,null,null,null,null,null,null,"Kosten","Standard kosten","Bezeichnung:"]
["FAI-Code",null,"Maßnahme",null,null,null,null,null,null,null,null,null,"Einheit","Menge",null,"Nettokosten"]
[null,null,"",null,null,null,null,null,null,null,null,null,null,null,null,null,null,null,null,null,null,null,null,null,null,null,1,{"$f":"IFERROR(INDEX(Carrier7,LD_Antrag_2023!AA74,2),\"\")","v":""}]
[null,null,null,null,null,null,null,null,null,null,null,null,null,null,null,null,null,null,null,null,null,null,null,null,null,null,1,{"$f":"IFERROR(INDEX(Carrier7,LD_Antrag_2023!AA75,2),\"\")","v":""}]
[null,null,null,null,null,null,null,null,null,null,null,null,null,null,null,null,null,null,null,null,null,null,null,null,null,null,1,{"$f":"IFERROR(INDEX(Carrier7,LD_Antrag_2023!AA76,2),\"\")","v":""}]
[null,null,"",null,null,null,null,null,null,null,null,null,null,null,null,null,null,null,null,null,null,null,null,null,null,null,1,{"$f":"IFERROR(INDEX(Carrier7,LD_Antrag_2023!AA77,2),\"\")","v":""}]
[null,null,null,null,null,null,null,null,null,null,null,null,null,"Summe:",null,{"$f":"SUM(P74:S77)","v":0}]
[null,null,null,null,null,null,null,null,null,null,null,null,null,"Gesamtsumme:"]
[]
["Wurden sonstige Öffentliche Mittel beantragt",null,null,null,null,null,null,null,null,null,null,"wenn Ja:","Wieviel:"]
[null,null,null,null,null,null,null,null,null,null,null,null,"Wo:"]
[]
["Der Förderwerber ist verpflichtet, im Förderantrag vollständige Angaben über beabsichtigte, laufende oder erledigte Förderanträge zum gleichen Vorhaben bei anderen Rechtsträgerinnen oder Dienststellen zu machen. Nach dem Tiroler Fördertransparenzgesetz, LGBI. Nr. 149/2012, ist die Landesregierung verpflichtet, bei Landesförderungen über einem Betrag von € 2.000,00 pro Förderart den vollständigen Namen, die Postleitzahl, die Art und Höhe der Förderung, die Gesamtinvestitionssumme, sofern diese ein Kriterium für die Höhe der Förderung ist, sowie die gewährten Kredite jährlich dem Landtag bekannt zu geben und auf der Landeshomepage zu veröffentlichen."]
[]
[]
[]
[]
[]
[]
[]
[]
[]
[null,null,null,null,null,null,null,null,null,null,"Ort, Datum",null,null,null,null,"Unterschrift"]
[]
["Verpflichtungserklärung"]
[]
[" „Zuwendungen zur Erholungsraumgestaltung“ – Richtlinie laut Beschluss der Tiroler Landesregierung vom 05.04.2016 "]
["1.1","Ich nehme die jeweils aktuelle Richtlinie „Zuwendungen zur Erholungsraumgestaltung“, als Grundlage für die Maßnahme(n), an der (denen) ich teilnehmen möchte, zur Kenntnis und verpflichte mich zur Einhaltung dieser Bestimmungen (https://www.tirol.gv.at/umwelt/wald/foerderung/erholung-und-erlebnis/allgemeine-foerdervorschriften-fuer-landschaftsdienstprojekte/) ."]
["1.2","Die Richtlinie enthält die allgemein geltenden Bedingungen für die Teilnahme und den Abschluss eines Vertrages zwischen mir und dem Land Tirol. Sie bildet einen integrierten Bestandteil des Vertrages, der zwischen mir auf Grund meines Antrages und dem Land Tirol auf Basis der Annahme dieses Antrages zustande kommt, soweit die Richtlinien Rechte, Bedingungen und Verpflichtungen für die Vertragsparteien enthalten."]
["1.3"," Die konkreten Voraussetzungen zur Umsetzung der Maßnahmen ergeben sich durch Bestimmungen des aktuell gültigen Förderkataloges Landschaftsdienst, auf Basis der oben genannten Richtlinie."]
["1.4","Mit der Antragstellung und Abgabe der unterzeichneten Verpflichtungserklärung, die ein integrierter Bestandteil des Antrages ist, kann ich mich nicht mehr darauf berufen, dass\n"]
["-1","ich die mich treffenden Verpflichtungen aus dem Vertrag mit dem Land Tirol nicht gekannt habe oder sie mir nicht verständlich gewesen sind oder dass"]
["-2","die von mir unterzeichneten Angaben mir nicht zurechenbar sind.                                                                                                                                                                                                                                                          Die Punkte -1 und -2 gelten gleichermaßen auch für alle anderen Vorkehrungen oder Unterlassungen im Zusammenhang mit der Antragstellung und Einhaltung des Vertrages.                         "]
["1.5","Ich habe vor Antragstellung eigeninitiativ alle geeigneten Maßnahmen zu ergreifen und Informationsangebote zu nutzen, die sicherstellen, dass ich vor Eingehen der Verpflichtung Kenntnis der mich treffenden Rechte und Pflichten, die mir aus dem Förderungsvertrag mit dem Land Tirol erwachsen, erlange."]
["1.6","Ich bin verpflichtet, über schriftliche Aufforderung der Bewilligenden Stelle (Abt. Forstorganisation,  Gruppe Forst) und unter Vorbehalt der Geltendmachung weitergehender gesetzlicher Ansprüche eine gewährte Förderung (wobei der Anspruch auf in Aussicht gestellte aber noch nicht ausbezahlte Förderungen erlischt) ganz oder teilweise binnen 14 Tagen zurückzuzahlen, soweit die vorgesehenen Bedingungen und Voraussetzungen (sofern bei der betreffenden Maßnahme vorgesehen) sowie auch anderweitige Verpflichtungen nicht oder nicht vollständig erfüllt sind, insbesondere wenn"]
["-1","die Beauftragten oder Organe der Fördereinreichstellen durch mich über Umstände, die für die Gewährung, das Ausmaß der Förderung oder die Aufrechterhaltung der Verpflichtung maßgebend sind, unrichtig oder unvollständig unterrichtet wurden oder mir zurechenbare Dritte dies getan haben."]
["-2","die in dieser Richtlinie vorgesehenen Fördervoraussetzungen nicht oder nicht vollständig erfüllt werden können oder erfüllt wurden bzw. die entsprechend den Fördervoraussetzungen zu erbringende Leistung (einschließlich Dokumentationspflicht, Meldepflicht, Publizität sowie Duldungs- und Mitwirkungspflichten) von mir nicht oder nicht rechtzeitig erbracht werden kann oder erbracht worden ist."]
["1.7","Ich verpflichte mich ausdrücklich"]
["-1","mit der Durchführung des Vorhabens gemäß dem vereinbarten Leistungszeitraum ansonsten unverzüglich nach Gewährung der Förderung zu beginnen, das Vorhaben zügig durchzuführen und dieses innerhalb der vereinbarten, ansonsten innerhalb einer angemessenen Frist, in Abstimmung mit der Bewilligenden Stelle, abzuschließen;"]
["-2","der Bewilligenden Stelle alle Ereignisse, welche die Durchführung des geförderten Vorhabens verzögern oder unmöglich machen, sowie eine Abänderung gegenüber dem Förderungsantrag oder der vereinbarten Auflagen und Bedingungen erforderlich machen würde, unverzüglich und aus eigener Initiative bekannt zu geben;"]
["-3","sicherzustellen, dass der Fördergegenstand ordnungsgemäß genutzt und instand gehalten wird, sowie frei zugänglich und unentgeltlich benutzt werden kann. Die Frist bei Infrastrukturmaßnahmen beträgt zehn Jahre ab Fälligkeit der Letztzahlung (=Behaltefrist);"]
["-4","den Beauftragten oder Organen der Förderstelle zu allen mit der Maßnahme direkt zusammenhängenden Flächen Zutritt zu gewähren, Einsicht in alle Unterlagen (die die Prüforgane für ihre Prüfung als erforderlich erachten) zu gewähren, sowie alle erforderlichen Auskünfte und Unterstützung erteilen und die Aufzeichnungen und Unterlagen mindestens sieben Jahre gerechnet ab Fälligkeit der Letztzahlung (=Behaltefrist) aufzubewahren;"]
["1.8","Ich kann bei Verstößen gegen die Bestimmungen dieser Richtlinie von dieser und anderen Fördermaßnahmen des Landes Tirol ausgeschlossen werden. Weitergehende rechtliche Ansprüche bleiben unberührt."]
["1.9","Ich nehme zur Kenntnis, dass auf Grund der §§ 7 bis 11 Datenschutzgesetz 2000 (DSG 2000), BGBl. I Nr. 1999/165, alle im Zusammenhang mit der Anbahnung und Abwicklung der Förderung mich betreffenden personenbezogenen Daten vom Land Tirol und von der von ihm beauftragten Förderabwicklungsstelle zu Abwicklungs- und Kontrollzwecken verwendet werden und es im Rahmen dieser Verwendung dazu kommen kann, dass die Daten insbesondere an Organe oder Beauftragte des Landeshauptmannes, des Bundesministeriums für Finanzen sowie des Rechnungshofes übermittelt werden können. Soweit EU-Rechtsvorschriften zwingend weitergehende Datenoffenlegungen vorsehen, bleiben diese unberührt."]
["2.0","Für Streitigkeiten aus dem durch die Förderung begründeten Rechtsverhältnis gilt als ausschließlicher Gerichtsstand Innsbruck."]
[]
["Ich bestätige mit meiner / meines Bevollmächtigten Unterschrift, dass ich alle vor- und nachstehenden Angaben mit bestem Wissen gemacht und die obenstehende Verpflichtungserklärung als Bestandteil des Vertrages als verbindlich zur Kenntnis genommen habe."]
[]
[null,null,"Ort;Datum",null,null,null,null,null,null,null,null,"Unterschrift des/der Förderungswerber/in oder Vertretungsbevollmächtigten *)\n*Die Unterschrift gilt auch für die einen integrierten Bestandteil des Antrages bildenden weiteren Unterlagen."]

{"sheet":"Auswahl","index":1,"n_rows":0,"n_cols":0,"rows_kept":0,"cut":false,"hidden":false,"merged":[]}

{"sheet":"Wander - u. Bergwege","index":2,"n_rows":14,"n_cols":4,"rows_kept":14,"cut":false,"hidden":false,"merged":[]}
["bitte wählen: Maßnahme","---",null,"-"]
["W-Generalinstandsetzung",711,null,"lfm"]
["W-Neu- und Ausbau",731,null,"lfm"]
["W-Sonderbauwerk",758,"Brücken > 10m Spannweite","-"]
["W-Leitsysteme/Beschilderung",756,null,"Stk"]
["W-Weideeinrichtungen",770,null,"-"]
["W-Projektmanagement",763,null,"-"]
["W-Adaption Barrierefreiheit",760,null,"-"]
["W-Rastplatz",715,null,"-"]
["W-Parkplatz/Stellplätze",718,null,"Stellplätze"]
["W-Spielplatz",720,null,"-"]
["W-Themenweg/Lehrpfad",713,null,"-"]
["W-Öffentlichkeitsarbeit",759,null,"-"]
["W-Zuwendungen Schutzhütten",722,null,"-"]

{"sheet":"MTB-Routen u. Singletrails","index":3,"n_rows":17,"n_cols":4,"rows_kept":17,"cut":false,"hidden":false,"merged":[]}
["bitte wählen: Maßnahme","---",null,"-"]
["MTB/ST-Generalinstandsetzung ",711,null,"lfm"]
["MTB/ST-Neu- und Ausbau",731,"Neubau von Singletrails u. MTB-Routen","lfm"]
["MTB/ST-Sonderbauwerke",758,"Brücken> 10 m Spannweite","-"]
["MTB/ST-Übungsgelände",769,null,"-"]
["MTB/ST-Weideeinrichtungen",770,null,"-"]
["MTB/ST-Projektmanagement",763,null,"-"]
["MTB/ST-Rastplatz",715,null,"-"]
["MTB/ST-Parkplatz/Stellplätze",718,null,"Stellplätze"]
["MTB/ST-Spielplatz",720,null,"-"]
[]
["MTB/ST-Leitsysteme/Beschilderung",756,null,"Stk"]
["MTB/ST-Austausch Beschilderung",757,null,"Stk"]
["MTB-gefördert",750,null,"lfm"]
["MTB-ohne Förderung",750,null,"lfm"]
["ST-gefördert",751,null,"lfm"]
["ST-ohne Förderung",751,null,"lfm"]

{"sheet":"Klettergärten","index":4,"n_rows":10,"n_cols":4,"rows_kept":10,"cut":false,"hidden":false,"merged":[]}
["bitte wählen: Maßnahme","---",null,"-"]
["KG-Generalinstandsetzung",711,null,"Anzahl"]
["KG-Neu- und Ausbau",731,null,"Anzahl"]
["KG-Zustiegsweg",709,null,"lfm"]
["KG-Leitsysteme/Beschilderung",756,null,"Stk"]
["KG-Projektmanagement",763,null,"-"]
["KG-Rastplatz",715,null,"-"]
["KG-Parkplatz/Stellplätze",718,null,"Stellplätze"]
["KG-Spielplatz",720,null,"-"]
["KG-Öffentlichkeitsarbeit",759,null,"-"]

{"sheet":"Klettersteige","index":5,"n_rows":11,"n_cols":4,"rows_kept":11,"cut":false,"hidden":false,"merged":[]}
["bitte wählen: Maßnahme","---",null,"-"]
["KS-Generalinstandsetzung",711,null,"lfm"]
["KS-Neu- und Ausbau",731,null,"lfm"]
["KS-Sonderbauwerke",758,"Seilbrücken > 10m Spannweite","-"]
["KS-Zustiegsweg",709,null,"lfm"]
["KS-Leitsysteme/Beschilderung",756,null,"Stk"]
["KS-Projektmanagement",763,null,"-"]
["KS-Rastplatz",715,null,"-"]
["KS-Parkplatz/Stellplätze",718,null,"Stellplätze"]
["KS-Spielplatz",720,null,"-"]
["KS-Öffentlichkeitsarbeit",759,null,"-"]

{"sheet":"Bouldergebiete","index":6,"n_rows":8,"n_cols":4,"rows_kept":8,"cut":false,"hidden":false,"merged":[]}
["bitte wählen: Maßnahme","---",null,"-"]
["BG-Generalinstandsetzung",711,null,"-"]
["BG-Zustiegsweg",709,null,"lfm"]
["BG-Leitsysteme/Beschilderung",756,null,"Stk"]
["BG-Projektmanagement",763,null,"-"]
["BG-Rastplatz",715,null,"-"]
["BG-Parkplatz/Stellplätze",718,null,"Stellplätze"]
["BG-Spielplatz",720,null,"-"]

{"sheet":"Pisten-u. Skitouren, Freeride","index":7,"n_rows":13,"n_cols":4,"rows_kept":13,"cut":false,"hidden":false,"merged":[]}
["bitte wählen: Maßnahme","---",null,"-"]
["PT-Leitsysteme/Beschilderung",756,null,"Stk"]
["PT-Wimpelleine",756,null,"lfm"]
["PT-Projektmanagement",768,null,"-"]
["Ski-Leitsysteme/Beschilderung",756,null,"Stk"]
["Ski-Wimpelleine",756,null,"lfm"]
["Ski-Projektmanagement",763,null,"-"]
["Ski-Öffentlichkeitsarbeit",759,null,"-"]
["Ski-Parkplätze/Stellplätze",718,null,"Stellplätze"]
["FR-Leitsysteme/Beschilderung",756,null,"Stk"]
["FR-Wimpelleine",756,null,"lfm"]
["FR-Projektmanagement",763,null,"-"]
["FR-Öffentlichkeitsarbeit",759,null,"-"]

{"sheet":"Winterwandewege","index":8,"n_rows":3,"n_cols":4,"rows_kept":3,"cut":false,"hidden":false,"merged":[]}
["bitte wählen: Maßnahme",null,null,"-"]
["WW-Leitsysteme/Beschilderung",756,null,"Stk"]
["WW-Öffentlichkeitsarbeit",759,null,"-"]

{"sheet":"LD- Infrastruktur","index":9,"n_rows":9,"n_cols":4,"rows_kept":9,"cut":false,"hidden":false,"merged":[]}
["bitte wählen: Maßnahme","---",null,"-"]
["LI-Rastplatz",715,null,"-"]
["LI-Parkplätze/Stellplätze",718,null,"Stellplätze"]
["LI-Spielplatz",720,null,"-"]
["LI-Themenweg/Lehrpfad",713,null,"-"]
["LI-Bepflanzung",728,null,"-"]
["LI-Weitere Infrastrukturmaßnahmen",766,null,"-"]
["LI-Projektmanagement",763,null,"-"]
["LI-Öffentlichkeitsarbeit",759,null,"-"]

{"sheet":"Leistsysteme-Beschilderung","index":10,"n_rows":5,"n_cols":4,"rows_kept":5,"cut":false,"hidden":false,"merged":[]}
["bitte wählen: Maßnahme","---",null,"-"]
["LS-Loipen",764,null,"Stk"]
["LS-weitere Leitsysteme",765,null,"Stk"]
["LS-Laufstrecken",767,null,"Stk"]
["LS-Trailrunning",767,null,"Stk"]

{"sheet":"Interressenausgleich Naturraum","index":11,"n_rows":2,"n_cols":4,"rows_kept":2,"cut":false,"hidden":false,"merged":[]}
["bitte wählen: Maßnahme","---",null,"-"]
["IA-Öffentlichkeitsarbeit",759,null,"-"]